{"text_format":"1","workbook":"xlsx","n_sheets":4,"sheets":["Instrucciones","Muestreo Secuencial","Numero de Parcelas","Dropdown Selections"],"not_rendered":{"charts":1,"images":3,"macros":1,"external_links":0,"defined_names":0,"comments":0,"pivot_tables":0},"unopened":[],"bounds":{"document_bytes":16777216,"sheet_cells":100000,"rows_first":2000,"rows_last":500,"rows_between":2000,"halvings":0,"cell_chars":16384,"cell_head_chars":4096},"cells_cut":0,"cells_raw":0,"read":"whole","date_system":"1900"}

{"sheet":"Instrucciones","index":0,"n_rows":30,"n_cols":6,"rows_kept":30,"cut":false,"hidden":false,"merged":[[29,2,29,16],[15,2,15,3],[23,2,23,16],[24,2,24,16],[25,2,25,16],[26,2,26,16],[27,2,27,16],[28,2,28,16],[4,1,4,16],[5,1,7,16],[9,1,9,16],[13,2,13,4],[22,1,22,4],[11,2,11,4],[12,2,12,4]]}
[]
[]
[null,"Muestreo Secuencial del tCO2/ha del Protocolo Forestal para México  V3.0 "]
[null,"Protocolo Forestal para México v3.0 (octubre de 2022)"]
[null,"DESCRIPCION GENERAL "]
[null,"Esta herramienta la proporciona la Reserva de Acción Climática para acompañar al Protocolo Forestal para México v3.0, para cumplir las verificaciones en sitio para Áreas de Actividad que utilizan la metodología del inventario del muestreo del campo.\n\nPara cualquier duda, comentario o sugerencia relacionada con esta herramienta, favor de mandar un correo electrónico a policy@climateactionreserve.org."]
[]
[]
[]
[null,"NAVEGACION"]
[null,null,"PESTAÑAS"]
[null,null,"Instrucciones",null,null,"Insturcciones para el uso de la herramienta y para cumplir el muestreo secuencial"]
[null,null,"Muestreo Secuencial",null,null,"Ingresar la información del Área de Actividad para cumplir el muestreo secuencial"]
[null,null,"Numero de Parcelas",null,null,"Numero de parcelas en secuencia requeridas para pasar el muestreo secuencial segun la informacion del Área de Actividad"]
[]
[null,null,"CELDAS"]
[null,null,null,null,null,"Ingresar la información requerida"]
[null,null,null,null,null,"Valores utilizados en los cálculos (son valores por defecto, no tiene que ingresar la información)"]
[]
[]
[]
[]
[null,"INSTRUCCIONES"]
[null,1,"Ingresar el promedio de tCO2e/ha para el Área de Actividad calculado para el fin del periodo de reporte del reporte de CALCBOSK en la Celda C6. Una respuesta de “Pass” en la Columna 10 indica que los resultados de la verificación muestran una tendencia hacia el éxito. Una respuesta “Inconclusive” significa que se requieren mas parcelas para indicar una resultado exitoso. "]
[null,2,"Ingresar los números de las parcelas que se proporciona CALCBOSK en la columna 7.  Ingresar los números de las parcelas en el orden en que fueron obtenidos de CACLBOSK hasta 100 parcelas. "]
[null,3," Solicitar los estimados de las toneladas (CO2e/Ha) estimadas para el fin del periodo de reporte de las parcelas del Desarrollador del Proyecto para cada parcela identificada en la columna 7. Ingresar los valores en la columna 8. "]
[null,4,"Medir las parcelas de la columna 7 en campo e ingresar los datos de las mediciones en CALCBOSK para determinar un estimado de CO2e/Ha. Ingresar los estimados obtenidos del verificador en la columna 9 en el espacio que corresponde a la parcela. Es aceptable que los verificadores midan las parcelas en un orden distinto al que se presenta en la columna 7. Sin embargo, la verificación no puede ser completada si las parcelas no están en el orden secuencial definido (como se seleccionaron aleatoriamente) y el estado de la verificación (columna 12) indica cuando la verificación es exitosa. "]
[null,5,"En la celda C7 seleccionar el numero de estratos verificados para el Área de Actividad."]
[null,6,"En la celda C8 seleccionar la categoría correcta para las hectáreas del Área de Actividad."]
[null,7,"Los verificadores sólo necesitan medir las parcelas necesarias para lograr una verificación exitosa. El mínimo de parcelas en secuencia depende en la información ingresada en pasos 5 y 6. Se puede encontrar el mínimo en la celda C9 del Muestreo Secuencial. Un Área de Actividad puede pasar el muestreo secuencial por pasar el mínimo numero de parcelas en secuencia O la primera parcela que pasa después de 12 parcelas. "]

{"sheet":"Muestreo Secuencial","index":1,"n_rows":125,"n_cols":18,"rows_kept":125,"cut":false,"hidden":false,"merged":[[0,0,0,5],[7,0,7,1],[8,0,8,1],[33,17,33,18],[22,2,22,3],[2,0,2,1],[3,0,3,1],[4,0,4,1],[5,0,5,1],[6,0,6,1],[22,5,22,6],[9,0,9,3]]}
["Protocolo Forestal para Mexico: Muestreo Secuencial"]
[]
["Tolerancia",null,0.1]
["Alfa",null,0.05]
["Beta:",null,0.2]
["Promedio\n(tCO2/Ha) para el Área de Actividad:"]
["Numero de Estratos Verificados en el Área de Actividad"]
["Hectareas en el Área de Actividad"]
["Número de Parcelas que Pasan Necesarias en la Secuencia*:",null,{"$f":"INDEX('Numero de Parcelas'!$A$7:$C$19,MATCH(1,('Numero de Parcelas'!$A$7:$A$19=C7)*('Numero de Parcelas'!$B$7:$B$19=C8),0),3)","v":{"$error":"#N/A"}}]
["*O la primera parcela que pasa despues de 12 parcelas."]
[]
[]
[]
[null,null,null,null,null,null,null,null,null,null,null,null,null,null,"D0:",{"$f":"'Muestreo Secuencial'!C6","v":0}]
[null,null,null,null,null,null,null,null,null,null,null,null,null,null,"D1:",{"$f":"'Muestreo Secuencial'!C3*'Muestreo Secuencial'!C6+P14","v":0}]
[]
[null,null,null,null,null,null,null,null,null,null,null,null,null,null,"Mean_Diff0:",{"$f":"P14-'Muestreo Secuencial'!C6","v":0}]
[]
[]
[null,null,null,null,null,null,null,null,null,null,null,null,null,null,"Mean_Diff1:",{"$f":"P15-P14","v":0}]
[]
[]
[null,null,"Data de Parcela"]
[6,7,8,9,10,11,12,13,14,15,16,17,18,null,"Zalpha:",{"$f":"NORMINV('Muestreo Secuencial'!$C$4,0,1)","v":-1.6448536269514726}]
["Parcela (n)","Número de Parcela","Proyecto\nCO2 tonnes/Ha","Verificación\nCO2 tonnes/Ha","Ejecución de la Examinación/Éxito de la parcela","Número de Parcelas que Pasan en la Secuencia","Estado de la verificación","Y(n)","-K","K","Media en marcha","Desviación Estándar en marcha","n_ umbral",null,"Zbeta:",{"$f":"NORMINV('Muestreo Secuencial'!$C$5,0,1)","v":-0.84162123357291452}]
[1,null,null,null,{"$f":"IF(H26<>\"\",IF(ABS((C26-D26))<(C3*D26),\"Pasar(H0)\",\"Inconclusivo\"),\"\")","v":""},{"$f":"IF(H26<>\"\",IF(E26=\"Pasar(H0)\",1,0),\"\")","v":""},{"$f":"IF(H26<>\"\",IF(OR(F26>=$C$9,AND(A26>12,E26=\"Pasar(H0)\")),\"Muestreo secuencial exitoso\",\"Muestreo secuencial no exitoso\"),\"\")","v":""},{"$f":"IF(C26<>\"\",IF(D26<>\"\",C26-D26,\"\"),\"\")","v":""},{"$f":"-'Muestreo Secuencial'!$P$26","v":0},{"$f":"'Muestreo Secuencial'!$P$26","v":0},{"$f":"'Muestreo Secuencial'!#REF!","v":{"$error":"#REF!"}},null,null,null,"K:",{"$f":"($P$24*$P$20+$P$25*$P$17)/($P$24+$P$25)","v":0}]
[2,null,null,null,{"$f":"IF(H27<>\"\",IF(A27>M27,IF(K27>'Muestreo Secuencial'!$P$26,\"Inconclusivo(H1)\",IF(K27<-'Muestreo Secuencial'!$P$26,\"Inconclusivo\", \"Pasar(H0)\")),\"Inconclusivo\"),\"\")","v":""},{"$f":"IF(H27<>\"\",IF(E27=\"Pasar(H0)\",1+F26,0),\"\")","v":""},{"$f":"IF(H27<>\"\",IF(OR(F27>=$C$9,AND(A27>12,E27=\"Pasar(H0)\")),\"Muestreo secuencial exitoso\",\"Muestreo secuencial no exitoso\"),\"\")","v":""},"",{"$f":"-'Muestreo Secuencial'!$P$26","v":0},{"$f":"'Muestreo Secuencial'!$P$26","v":0},{"$f":"IF(H27<>\"\",AVERAGE($H$26:H27),\"\")","v":""},{"$f":"IF(H27<>\"\",STDEV($H$26:H27),\"\")","v":""},{"$f":"IF(H27<>\"\",(('Muestreo Secuencial'!$P$24+'Muestreo Secuencial'!$P$25)^2*L27^2)/($C$3*$C$6)^2,\"\")","v":""}]
[3,null,null,null,{"$f":"IF(H28<>\"\",IF(A28>M28,IF(K28>'Muestreo Secuencial'!$P$26,\"Inconclusivo(H1)\",IF(K28<-'Muestreo Secuencial'!$P$26,\"Inconclusivo\", \"Pasar(H0)\")),\"Inconclusivo\"),\"\")","v":""},"","","",{"$f":"-'Muestreo Secuencial'!$P$26","v":0},{"$f":"'Muestreo Secuencial'!$P$26","v":0},{"$f":"IF(H28<>\"\",AVERAGE($H$26:H28),\"\")","v":""},{"$f":"IF(H28<>\"\",STDEV($H$26:H28),\"\")","v":""},{"$f":"IF(H28<>\"\",(('Muestreo Secuencial'!$P$24+'Muestreo Secuencial'!$P$25)^2*L28^2)/($C$3*$C$6)^2,\"\")","v":""}]
[4,null,null,null,{"$f":"IF(H29<>\"\",IF(A29>M29,IF(K29>'Muestreo Secuencial'!$P$26,\"Inconclusivo(H1)\",IF(K29<-'Muestreo Secuencial'!$P$26,\"Inconclusivo\", \"Pasar(H0)\")),\"Inconclusivo\"),\"\")","v":""},"","","",{"$f":"-'Muestreo Secuencial'!$P$26","v":0},{"$f":"'Muestreo Secuencial'!$P$26","v":0},{"$f":"IF(H29<>\"\",AVERAGE($H$26:H29),\"\")","v":""},{"$f":"IF(H29<>\"\",STDEV($H$26:H29),\"\")","v":""},{"$f":"IF(H29<>\"\",(('Muestreo Secuencial'!$P$24+'Muestreo Secuencial'!$P$25)^2*L29^2)/($C$3*$C$6)^2,\"\")","v":""}]
[5,null,null,null,{"$f":"IF(H30<>\"\",IF(A30>M30,IF(K30>'Muestreo Secuencial'!$P$26,\"Inconclusivo(H1)\",IF(K30<-'Muestreo Secuencial'!$P$26,\"Inconclusivo\", \"Pasar(H0)\")),\"Inconclusivo\"),\"\")","v":""},"","","",{"$f":"-'Muestreo Secuencial'!$P$26","v":0},{"$f":"'Muestreo Secuencial'!$P$26","v":0},{"$f":"IF(H30<>\"\",AVERAGE($H$26:H30),\"\")","v":""},{"$f":"IF(H30<>\"\",STDEV($H$26:H30),\"\")","v":""},{"$f":"IF(H30<>\"\",(('Muestreo Secuencial'!$P$24+'Muestreo Secuencial'!$P$25)^2*L30^2)/($C$3*$C$6)^2,\"\")","v":""}]
[6,null,null,null,{"$f":"IF(H31<>\"\",IF(A31>M31,IF(K31>'Muestreo Secuencial'!$P$26,\"Inconclusivo(H1)\",IF(K31<-'Muestreo Secuencial'!$P$26,\"Inconclusivo\", \"Pasar(H0)\")),\"Inconclusivo\"),\"\")","v":""},"","","",{"$f":"-'Muestreo Secuencial'!$P$26","v":0},{"$f":"'Muestreo Secuencial'!$P$26","v":0},{"$f":"IF(H31<>\"\",AVERAGE($H$26:H31),\"\")","v":""},{"$f":"IF(H31<>\"\",STDEV($H$26:H31),\"\")","v":""},{"$f":"IF(H31<>\"\",(('Muestreo Secuencial'!$P$24+'Muestreo Secuencial'!$P$25)^2*L31^2)/($C$3*$C$6)^2,\"\")","v":""}]
[7,null,null,null,{"$f":"IF(H32<>\"\",IF(A32>M32,IF(K32>'Muestreo Secuencial'!$P$26,\"Inconclusivo(H1)\",IF(K32<-'Muestreo Secuencial'!$P$26,\"Inconclusivo\", \"Pasar(H0)\")),\"Inconclusivo\"),\"\")","v":""},"","","",{"$f":"-'Muestreo Secuencial'!$P$26","v":0},{"$f":"'Muestreo Secuencial'!$P$26","v":0},{"$f":"IF(H32<>\"\",AVERAGE($H$26:H32),\"\")","v":""},{"$f":"IF(H32<>\"\",STDEV($H$26:H32),\"\")","v":""},{"$f":"IF(H32<>\"\",(('Muestreo Secuencial'!$P$24+'Muestreo Secuencial'!$P$25)^2*L32^2)/($C$3*$C$6)^2,\"\")","v":""}]
[8,null,null,null,{"$f":"IF(H33<>\"\",IF(A33>M33,IF(K33>'Muestreo Secuencial'!$P$26,\"Inconclusivo(H1)\",IF(K33<-'Muestreo Secuencial'!$P$26,\"Inconclusivo\", \"Pasar(H0)\")),\"Inconclusivo\"),\"\")","v":""},"","","",{"$f":"-'Muestreo Secuencial'!$P$26","v":0},{"$f":"'Muestreo Secuencial'!$P$26","v":0},{"$f":"IF(H33<>\"\",AVERAGE($H$26:H33),\"\")","v":""},{"$f":"IF(H33<>\"\",STDEV($H$26:H33),\"\")","v":""},{"$f":"IF(H33<>\"\",(('Muestreo Secuencial'!$P$24+'Muestreo Secuencial'!$P$25)^2*L33^2)/($C$3*$C$6)^2,\"\")","v":""}]
[9,null,null,null,{"$f":"IF(H34<>\"\",IF(A34>M34,IF(K34>'Muestreo Secuencial'!$P$26,\"Inconclusivo(H1)\",IF(K34<-'Muestreo Secuencial'!$P$26,\"Inconclusivo\", \"Pasar(H0)\")),\"Inconclusivo\"),\"\")","v":""},"","","",{"$f":"-'Muestreo Secuencial'!$P$26","v":0},{"$f":"'Muestreo Secuencial'!$P$26","v":0},{"$f":"IF(H34<>\"\",AVERAGE($H$26:H34),\"\")","v":""},{"$f":"IF(H34<>\"\",STDEV($H$26:H34),\"\")","v":""},{"$f":"IF(H34<>\"\",(('Muestreo Secuencial'!$P$24+'Muestreo Secuencial'!$P$25)^2*L34^2)/($C$3*$C$6)^2,\"\")","v":""}]
[10,null,null,null,{"$f":"IF(H35<>\"\",IF(A35>M35,IF(K35>'Muestreo Secuencial'!$P$26,\"Inconclusivo(H1)\",IF(K35<-'Muestreo Secuencial'!$P$26,\"Inconclusivo\", \"Pasar(H0)\")),\"Inconclusivo\"),\"\")","v":""},"","","",{"$f":"-'Muestreo Secuencial'!$P$26","v":0},{"$f":"'Muestreo Secuencial'!$P$26","v":0},{"$f":"IF(H35<>\"\",AVERAGE($H$26:H35),\"\")","v":""},{"$f":"IF(H35<>\"\",STDEV($H$26:H35),\"\")","v":""},{"$f":"IF(H35<>\"\",(('Muestreo Secuencial'!$P$24+'Muestreo Secuencial'!$P$25)^2*L35^2)/($C$3*$C$6)^2,\"\")","v":""}]
[11,null,null,null,{"$f":"IF(H36<>\"\",IF(A36>M36,IF(K36>'Muestreo Secuencial'!$P$26,\"Inconclusivo(H1)\",IF(K36<-'Muestreo Secuencial'!$P$26,\"Inconclusivo\", \"Pasar(H0)\")),\"Inconclusivo\"),\"\")","v":""},"","","",{"$f":"-'Muestreo Secuencial'!$P$26","v":0},{"$f":"'Muestreo Secuencial'!$P$26","v":0},{"$f":"IF(H36<>\"\",AVERAGE($H$26:H36),\"\")","v":""},{"$f":"IF(H36<>\"\",STDEV($H$26:H36),\"\")","v":""},{"$f":"IF(H36<>\"\",(('Muestreo Secuencial'!$P$24+'Muestreo Secuencial'!$P$25)^2*L36^2)/($C$3*$C$6)^2,\"\")","v":""}]
[12,null,null,null,{"$f":"IF(H37<>\"\",IF(A37>M37,IF(K37>'Muestreo Secuencial'!$P$26,\"Inconclusivo(H1)\",IF(K37<-'Muestreo Secuencial'!$P$26,\"Inconclusivo\", \"Pasar(H0)\")),\"Inconclusivo\"),\"\")","v":""},"","","",{"$f":"-'Muestreo Secuencial'!$P$26","v":0},{"$f":"'Muestreo Secuencial'!$P$26","v":0},{"$f":"IF(H37<>\"\",AVERAGE($H$26:H37),\"\")","v":""},{"$f":"IF(H37<>\"\",STDEV($H$26:H37),\"\")","v":""},{"$f":"IF(H37<>\"\",(('Muestreo Secuencial'!$P$24+'Muestreo Secuencial'!$P$25)^2*L37^2)/($C$3*$C$6)^2,\"\")","v":""}]
[13,null,null,null,{"$f":"IF(H38<>\"\",IF(A38>M38,IF(K38>'Muestreo Secuencial'!$P$26,\"Inconclusivo(H1)\",IF(K38<-'Muestreo Secuencial'!$P$26,\"Inconclusivo\", \"Pasar(H0)\")),\"Inconclusivo\"),\"\")","v":""},"","","",{"$f":"-'Muestreo Secuencial'!$P$26","v":0},{"$f":"'Muestreo Secuencial'!$P$26","v":0},{"$f":"IF(H38<>\"\",AVERAGE($H$26:H38),\"\")","v":""},{"$f":"IF(H38<>\"\",STDEV($H$26:H38),\"\")","v":""},{"$f":"IF(H38<>\"\",(('Muestreo Secuencial'!$P$24+'Muestreo Secuencial'!$P$25)^2*L38^2)/($C$3*$C$6)^2,\"\")","v":""}]
[14,null,null,null,{"$f":"IF(H39<>\"\",IF(A39>M39,IF(K39>'Muestreo Secuencial'!$P$26,\"Inconclusivo(H1)\",IF(K39<-'Muestreo Secuencial'!$P$26,\"Inconclusivo\", \"Pasar(H0)\")),\"Inconclusivo\"),\"\")","v":""},"","","",{"$f":"-'Muestreo Secuencial'!$P$26","v":0},{"$f":"'Muestreo Secuencial'!$P$26","v":0},{"$f":"IF(H39<>\"\",AVERAGE($H$26:H39),\"\")","v":""},{"$f":"IF(H39<>\"\",STDEV($H$26:H39),\"\")","v":""},{"$f":"IF(H39<>\"\",(('Muestreo Secuencial'!$P$24+'Muestreo Secuencial'!$P$25)^2*L39^2)/($C$3*$C$6)^2,\"\")","v":""}]
[15,null,null,null,{"$f":"IF(H40<>\"\",IF(A40>M40,IF(K40>'Muestreo Secuencial'!$P$26,\"Inconclusivo(H1)\",IF(K40<-'Muestreo Secuencial'!$P$26,\"Inconclusivo\", \"Pasar(H0)\")),\"Inconclusivo\"),\"\")","v":""},"","","",{"$f":"-'Muestreo Secuencial'!$P$26","v":0},{"$f":"'Muestreo Secuencial'!$P$26","v":0},{"$f":"IF(H40<>\"\",AVERAGE($H$26:H40),\"\")","v":""},{"$f":"IF(H40<>\"\",STDEV($H$26:H40),\"\")","v":""},{"$f":"IF(H40<>\"\",(('Muestreo Secuencial'!$P$24+'Muestreo Secuencial'!$P$25)^2*L40^2)/($C$3*$C$6)^2,\"\")","v":""}]
{"$rows_left_out":86}
{"sheet":"Numero de Parcelas","index":2,"n_rows":36,"n_cols":8,"rows_kept":36,"cut":false,"hidden":false,"merged":[]}
["Strata","Hectares"]
[1,"<200"]
[2,"201-2000"]
[3,"2001-4000"]
[null,">4000"]
[]
["Number of Strata","Hectares","Minimum Number of Plots"]
[1,"<200",6]
[1,"201-2000",8]
[1,"2001-4000",10]
[1,">4000",12]
[2,"<200",4]
[2,"201-2000",6]
[2,"2001-4000",7]
[2,">4000",8]
[3,"<200",3]
[3,"201-2000",4]
[3,"2001-4000",5]
[3,">4000",6]
[]
[]
[]
[]
[]
[]
[]
[]
[]
[]
[]
[]
[]
[]
[]
[]
[null,null,null,null,null,null,null," "]

{"sheet":"Dropdown Selections","index":3,"n_rows":6,"n_cols":2,"rows_kept":6,"cut":false,"hidden":true,"merged":[]}
["strata","acreage"]
[1,"<100"]
[2,"100-500"]
[3,"501-5,000"]
[null,"5,001-10,000"]
[null,">10,000"]